{"text_format":"1","workbook":"xlsx","n_sheets":8,"sheets":["Cover Page","BHS - Manual Balancing Valve","BHS - Pressure Independent","Copyright","Language","Information Boxes","Units","Data"],"not_rendered":{"charts":0,"images":24,"macros":1,"external_links":0,"defined_names":1,"comments":1,"pivot_tables":0},"unopened":[],"bounds":{"document_bytes":16777216,"sheet_cells":100000,"rows_first":2000,"rows_last":500,"rows_between":2000,"halvings":0,"cell_chars":16384,"cell_head_chars":4096},"cells_cut":0,"cells_raw":0,"read":"row_number_cap","date_system":"1900"}

{"sheet":"Cover Page","index":0,"n_rows":0,"n_cols":0,"rows_kept":0,"cut":false,"hidden":false,"merged":[[11,3,11,5],[12,4,12,5]]}

{"sheet":"BHS - Manual Balancing Valve","index":1,"n_rows":50,"n_cols":27,"rows_kept":50,"cut":false,"hidden":true,"merged":[[11,1,11,3],[16,1,16,3],[1,1,3,10],[37,20,37,21],[37,24,37,25],[25,20,25,21],[26,20,26,21],[25,24,25,25],[26,24,26,25],[26,16,26,17],[35,20,35,21],[36,20,36,21],[8,12,8,13],[9,12,9,13],[10,12,10,13],[9,16,9,17],[27,16,27,17],[28,16,28,17],[38,12,38,13],[38,16,38,17],[38,20,38,21],[38,24,38,25],[37,12,37,13],[37,16,37,17],[35,16,35,17],[36,16,36,17],[36,24,36,25],[25,12,25,13],[26,12,26,13],[35,12,35,13],[36,12,36,13],[27,12,27,13],[28,12,28,13],[9,24,9,25],[10,24,10,25],[19,12,19,13],[18,12,18,13],[17,16,17,17],[10,16,10,17],[18,16,18,17],[19,16,19,17],[6,1,6,3],[8,2,8,3],[10,20,10,21],[9,20,9,21],[35,24,35,25],[27,20,27,21],[28,20,28,21],[27,24,27,25],[28,24,28,25],[18,20,18,21],[19,20,19,21],[19,24,19,25],[18,24,18,25],[12,1,12,3],[15,1,15,3],[25,16,25,17]]}
[]
[null,"Belimo Hydronic Simulator™"]
[]
[]
[]
[]
[null,{"$f":"INDEX(Language!$6:$6,MATCH(Language!$H$2,Language!$1:$1,0))","v":"Design Settings"}]
[null,{"$f":"INDEX(Language!$7:$7,MATCH(Language!$H$2,Language!$1:$1,0))","v":"Flow per coil"},{"$f":"Data!B15","v":0.9},{"$f":"Data!B14","v":"GPM"},null,null,null,{"$f":"Data!Y29","v":"5.07 GPM"}]
{"$rows_left_out":43}
{"sheet":"BHS - Pressure Independent","index":2,"n_rows":50,"n_cols":27,"rows_kept":50,"cut":false,"hidden":true,"merged":[[1,1,3,10],[8,12,8,13],[9,12,9,13],[6,1,6,3],[8,2,8,3],[9,20,9,21],[9,24,9,25],[10,12,10,13],[10,16,10,17],[10,20,10,21],[10,24,10,25],[9,16,9,17],[18,20,18,21],[18,24,18,25],[25,12,25,13],[25,16,25,17],[25,20,25,21],[25,24,25,25],[19,12,19,13],[19,16,19,17],[19,20,19,21],[19,24,19,25],[11,1,11,3],[12,1,12,3],[17,16,17,17],[18,12,18,13],[18,16,18,17],[15,1,15,3],[16,1,16,3],[27,12,27,13],[27,16,27,17],[27,20,27,21],[27,24,27,25],[26,12,26,13],[26,16,26,17],[26,20,26,21],[26,24,26,25],[28,12,28,13],[28,16,28,17],[28,20,28,21],[28,24,28,25],[35,12,35,13],[35,16,35,17],[35,20,35,21],[35,24,35,25],[38,12,38,13],[38,16,38,17],[38,20,38,21],[38,24,38,25],[36,12,36,13],[36,16,36,17],[36,20,36,21],[36,24,36,25],[37,12,37,13],[37,16,37,17],[37,20,37,21],[37,24,37,25]],"read":"row_number_cap"}
[]
[null,"Belimo Hydronic Simulator™"]
[]
[]
[]
[]
[null,{"$f":"INDEX(Language!$6:$6,MATCH(Language!$H$2,Language!$1:$1,0))","v":"Design Settings"}]
[null,{"$f":"INDEX(Language!$7:$7,MATCH(Language!$H$2,Language!$1:$1,0))","v":"Flow per coil"},{"$f":"Data!B15","v":0.9},{"$f":"Data!B14","v":"GPM"},null,null,null,{"$f":"Data!Y30","v":"5.09 GPM"}]
{"$rows_left_out":43}
{"sheet":"Copyright","index":3,"n_rows":8,"n_cols":3,"rows_kept":8,"cut":false,"hidden":false,"merged":[]}
[]
[null,"BELIMO HYDRONIC SIMULATOR ™ "]
[]
[null,"© BELIMO HOLDING AG 2018","© BELIMO HOLDING AG 2018"]
[]
[null,"Rechte am Geistigen Eigentum","Intellectual Property Rights"]
[]
[null,"Sämtliche Rechte, Titel und Ansprüche (einschliesslich Copyrights, Marken, Patente und anderer Rechte an geistigem Eigentum) an allen Informationen und Inhalten (einschliesslich aller Texte, Daten, Grafiken und Logos) des BELIMO Hydronic Simulator™ verbleiben bei der BELIMO oder dem jeweiligen Rechteinhaber. Einzelne Seiten, Teile oder Ergebnisse des BELIMO Hydronic Simulator™ dürfen ausschliesslich zu privater oder interner Verwendung ausgedruckt werden, und nur insoweit als der jeweilige Ausdruck alle betreffenden Hinweise auf Copyrights und andere Eigentumsrechte enthält. Es ist den Benutzern verboten, irgendwelche Informationen, Texte, Grafiken, Bilder, Datenbanken, Listen oder Software, die vom BELIMO Hydronic Simulator™ stammen, im Ganzen oder teilweise ohne die vorherige schriftliche Genehmigung von BELIMO zu verändern, zu kopieren, zu senden, weiterzugeben, auszustellen, vorzuführen, zu reproduzieren, zu veröffentlichen, zu lizenzieren, als Frame in einer Webseite zu verwenden, zu übertragen und von den genannten Inhalten abgeleitete Werke zu erstellen oder sie auf andere Art für gewerbliche oder öffentliche Zwecke zu nutzen. ","BELIMO, or the applicable third-party owner, retains all right, title and interest (including copyrights, trademarks, patents, as well as any other intellectual property right) in all information and content (including all text, data, graphics and logos) on the BELIMO Hydronic Simulator™. Individual pages, sections or results of the BELIMO Hydronic Simulator™ may be printed for personal or internal use only, and provided that such printouts retain all applicable copyright or other proprietary notices. All users must not, without limitation, modify, copy, transmit, distribute, display, perform, reproduce, publish, license, frame, create derivative works from, transfer or otherwise use in any other way, whether in whole or in part, any information, text, graphics, images, databases, listings or software obtained from the BELIMO Hydronic Simulator™for commercial or public purposes, without the prior written permission of BELIMO. "]
{"$rows_left_out":1}
{"sheet":"Language","index":4,"n_rows":22,"n_cols":8,"rows_kept":22,"cut":false,"hidden":true,"merged":[]}
["Shape Name","English","French","Spanish","Portuguese",null,null,"Selected Language"]
["LabelSelectLanguage","Select Language","Sélectionnez la Langue","Seleccione el Idioma","Selecione o Idioma",null,null,"English"]
["LabelSelectFlowUnits","Select the Flow units","Sélectionnez les unités de mesure du débit","Seleccione las unidades de flujo","Selecione as unidades de vazão"]
["LabelSelectFlowPerCoil","Select the Flow per coil","Sélectionnez le débit par serpentin","Seleccione el flujo por serpentín","Selecione a vazão por unidade terminal"]
["LabelSelectDeltaPUnits","Select the Delta P units","Sélectionnez les unités de mesure du delta P","Seleccione las unidades de Delta P","Selecione as unidades de Delta P"]
[null,"Design Settings","Paramètre de conception","Dados de diseño","Dados de projeto"]
[null,"Flow per coil","Débit","Flujo","Vazão p/ coil"]
[null,"Delta P Units","Unités Dp","Unidades Dp","Unidade Dp"]
{"$rows_left_out":15}
{"sheet":"Information Boxes","index":5,"n_rows":7,"n_cols":2,"rows_kept":7,"cut":false,"hidden":true,"merged":[]}
["Button","Information"]
["GPMInfo",{"$f":"INDEX(Language!$22:$22,MATCH(Language!$H$2,Language!$1:$1,0))","v":"Current flow in the coil"}]
["PercentInfo",{"$f":"INDEX(Language!$21:$21,MATCH(Language!$H$2,Language!$1:$1,0))","v":"Flow percentage in the coil"}]
["PSIInfo",{"$f":"INDEX(Language!$17:$17,MATCH(Language!$H$2,Language!$1:$1,0))","v":"Pressure drop across the manual balancing valve"}]
["OpenCloseInfo",{"$f":"INDEX(Language!$20:$20,MATCH(Language!$H$2,Language!$1:$1,0))","v":"Open or Close manual balancing valve"}]
["TurnInfo",{"$f":"INDEX(Language!$18:$18,MATCH(Language!$H$2,Language!$1:$1,0))","v":"Turns in the manual balancing valve"}]
["PipesInfo",{"$f":"INDEX(Language!$19:$19,MATCH(Language!$H$2,Language!$1:$1,0))","v":"Blue pipe – Supply / Red pipe - Return"}]

{"sheet":"Units","index":6,"n_rows":38,"n_cols":26,"rows_kept":38,"cut":false,"hidden":true,"merged":[[27,2,27,5],[37,2,37,4]]}
[]
[]
[]
[]
[]
[null,null,null,null,null,"Some parameters",null,null,"Suggested","Chosen","Units"]
[null,null,null,null,null,null,null,null,null,null,null,null,null,null,null,null,null,null,null,null,null,null,"kPa-l/h"]
[null,null,"Click on the units required",null,null,"Dp pipes between the risers",null,null,{"$f":"Z11","v":12},{"$f":"I8","v":12},{"$f":"$S$14","v":"kPa"},null,null,null,null,null,null,null,null,"Flow","Dp","Suggested","Chosen"]
{"$rows_left_out":31}
{"sheet":"Data","index":7,"n_rows":49,"n_cols":172,"rows_kept":49,"cut":false,"hidden":true,"merged":[]}
[null,null,null,null,null,null,null,null,null,null,null,null,null,null,null,null,null,null,null,null,null,null,null,null,null,null,null,null,null,null,null,null,null,null,"kPa"]
[null,null,null,null,null,null,null,{"$f":"AJ4","v":4.0000000000001004},null,null,null,null,null,{"$f":"$BJ4","v":4.0000000000001004},null,null,null,null,null,{"$f":"CJ4","v":4.0000000000001004},null,null,null,null,null,{"$f":"$DJ4","v":4.0000000000001004},null,null,null,null,null,100,{"$f":"Units!$W$13","v":204.3},"Min",{"$f":"Units!$W$10","v":3},"Kvs=",{"$f":"0.01*$AG$2/$AI$2^0.5","v":1.1795265999544056},"L=",{"$f":"Units!$W$12","v":2},"Units","l/h","kPa","Corr",{"$f":"Units!$T$14","v":227},{"$f":"Units!$U$14","v":1},null,null,"STAD","q%",null,null,{"$f":"Units!$R$14:$U$14","v":"GPM"},"kPa",227,1,null,null,200,{"$f":"Units!$W$13","v":204.3},"Min",{"$f":"Units!$W$10","v":3},"Kvs=",{"$f":"0.01*$AG$2/$AI$2^0.5","v":1.1795265999544056},"L=",{"$f":"Units!$W$12","v":2},"Units","l/h","kPa","Corr",{"$f":"Units!$T$14","v":227},{"$f":"Units!$U$14","v":1},null,null,"STAD","q%",null,null,null,null,null,null,null,null,"qc",{"$f":"Units!$W$13","v":204.3},"Min",{"$f":"Units!$W$10","v":3},"Kvs=",{"$f":"0.01*$AG$2/$AI$2^0.5","v":1.1795265999544056},"L=",{"$f":"Units!$W$12","v":2},"Units","l/h","kPa","Corr",{"$f":"Units!$T$14","v":227},{"$f":"Units!$U$14","v":1},null,null,"STAD","q%",null,null,null,null,null,null,null,null,"qc",{"$f":"Units!$W$13","v":204.3},"Min",{"$f":"Units!$W$10","v":3},"Kvs=",{"$f":"0.01*$AG$2/$AI$2^0.5","v":1.1795265999544056},"L=",{"$f":"Units!$W$12","v":2},"Units","l/h","kPa","Corr",{"$f":"Units!$T$14","v":227},{"$f":"Units!$U$14","v":1},null,null,"STAD","q%",null,"Kv","Max","Min","Pos","Kv2","Max","Min","Pos","Kv2","Max","Min","Pos","Kv2","Max","Min","Pos","Kv2","Max","Min","Pos","Kv2","Max","Min","Pos","Kv2","Max","Min","Pos","Kv2","Max","Min","Pos","Kv2","Max","Min","Pos","Kv2","Max","Min","Pos","Kv2","Max","Min","Pos"]
[null,null,null,null,null,null,null,null,null,{"$f":"IF(AU6&\" \"&$AZ$2=\"0.0001 GPM\",\"0 GPM\",AU6&\" \"&$AZ$2)","v":"1.67 GPM"},null,null,null,null,null,{"$f":"IF(BU6&\" \"&$AZ$2=\"0.0001 GPM\",\"0 GPM\",BU6&\" \"&$AZ$2)","v":"1.28 GPM"},null,null,null,null,null,{"$f":"IF(CU6&\" \"&$AZ$2=\"0.0001 GPM\",\"0 GPM\",CU6&\" \"&$AZ$2)","v":"1.05 GPM"},null,null,null,null,null,{"$f":"IF(DU6&\" \"&$AZ$2=\"0.0001 GPM\",\"0 GPM\",DU6&\" \"&$AZ$2)","v":"0.7 GPM"},null,null,false,"Pos5",null,null,"Units","Pos",{"$f":"\"C\"&(6-AM4)","v":"C5"},{"$f":"\"KvC\"&(6-AM4)","v":"KvC5"},"Nb",{"$f":"\"KvL\"&(6-AM4)","v":"KvL5"},{"$f":"\"Kvs\"&(6-AM4)","v":"Kvs5"},null,null,{"$f":"\"KV\"&(6-AM4)","v":"KV5"},"PE",null,{"$f":"\"q5\"","v":"q5"},null,null,null,null,null,null,null,null,null,false,"Pos5",null,null,null,"Pos",{"$f":"\"C\"&(6-BM4)","v":"C5"},{"$f":"\"KvC\"&(6-BM4)","v":"KvC5"},"Nb",{"$f":"\"KvL\"&(6-BM4)","v":"KvL5"},{"$f":"\"Kvs\"&(6-BM4)","v":"Kvs5"},null,null,{"$f":"\"KV\"&(6-BM4)","v":"KV5"},"PE",null,{"$f":"\"q5\"","v":"q5"},null,null,null,null,null,null,null,null,null,false,"Pos5",null,null,null,"Pos",{"$f":"\"C\"&(6-CM4)","v":"C5"},{"$f":"\"KvC\"&(6-CM4)","v":"KvC5"},"Nb",{"$f":"\"KvL\"&(6-CM4)","v":"KvL5"},{"$f":"\"Kvs\"&(6-CM4)","v":"Kvs5"},null,null,{"$f":"\"KV\"&(6-CM4)","v":"KV5"},"PE",null,{"$f":"\"q5\"","v":"q5"},null,null,null,null,null,null,null,null,null,false,"Pos5",null,null,null,"Pos",{"$f":"\"C\"&(6-DM4)","v":"C5"},{"$f":"\"KvC\"&(6-DM4)","v":"KvC5"},"Nb",{"$f":"\"KvL\"&(6-DM4)","v":"KvL5"},{"$f":"\"Kvs\"&(6-DM4)","v":"Kvs5"},null,null,{"$f":"\"KV\"&(6-DM4)","v":"KV5"},"PE",null,{"$f":"\"q5\"","v":"q5"},null,null,null,{"$f":"0.01*B15*BB2/(C15*BC2)^0.5","v":1.1795265999544056},4,0,{"$f":"(DZ3+EA3)/2","v":2},{"$f":"$BA$7*0.4/(4/EB3-0.6)+10^-10","v":0.33700760008697306},{"$f":"IF(EC3>$DY$3,EB3,DZ3)","v":4},{"$f":"IF(EC3>$DY$3,EA3,EB3)","v":2},{"$f":"(ED3+EE3)/2","v":3},{"$f":"$BA$7*0.4/(4/EF3-0.6)+10^-10","v":0.64337814552967587},{"$f":"IF(EG3>$DY$3,EF3,ED3)","v":4},{"$f":"IF(EG3>$DY$3,EE3,EF3)","v":3},{"$f":"(EH3+EI3)/2","v":3.5},{"$f":"$BA$7*0.4/(4/EJ3-0.6)+10^-10","v":0.86912486322429894},{"$f":"IF(EK3>$DY$3,EJ3,EH3)","v":4},{"$f":"IF(EK3>$DY$3,EI3,EJ3)","v":3.5},{"$f":"(EL3+EM3)/2","v":3.75},{"$f":"$BA$7*0.4/(4/EN3-0.6)+10^-10","v":1.0110228000609192},{"$f":"IF(EO3>$DY$3,EN3,EL3)","v":4},{"$f":"IF(EO3>$DY$3,EM3,EN3)","v":3.75},{"$f":"(EP3+EQ3)/2","v":3.875},{"$f":"$BA$7*0.4/(4/ER3-0.6)+10^-10","v":1.09150222692348},{"$f":"IF(ES3>$DY$3,ER3,EP3)","v":4},{"$f":"IF(ES3>$DY$3,EQ3,ER3)","v":3.875},{"$f":"(ET3+EU3)/2","v":3.9375},{"$f":"$BA$7*0.4/(4/EV3-0.6)+10^-10","v":1.1345065008195048},{"$f":"IF(EW3>$DY$3,EV3,ET3)","v":4},{"$f":"IF(EW3>$DY$3,EU3,EV3)","v":3.9375},{"$f":"(EX3+EY3)/2","v":3.96875},{"$f":"$BA$7*0.4/(4/EZ3-0.6)+10^-10","v":1.1567558162715021},{"$f":"IF(FA3>$DY$3,EZ3,EX3)","v":4},{"$f":"IF(FA3>$DY$3,EY3,EZ3)","v":3.96875},{"$f":"(FB3+FC3)/2","v":3.984375},{"$f":"$BA$7*0.4/(4/FD3-0.6)+10^-10","v":1.1680748854917415},{"$f":"IF(FE3>$DY$3,FD3,FB3)","v":4},{"$f":"IF(FE3>$DY$3,FC3,FD3)","v":3.984375},{"$f":"(FF3+FG3)/2","v":3.9921875},{"$f":"$BA$7*0.4/(4/FH3-0.6)+10^-10","v":1.1737840168024369},{"$f":"IF(FI3>$DY$3,FH3,FF3)","v":4},{"$f":"IF(FI3>$DY$3,FG3,FH3)","v":3.9921875},{"$f":"(FJ3+FK3)/2","v":3.99609375},{"$f":"$BA$7*0.4/(4/FL3-0.6)+10^-10","v":1.17665110858694},{"$f":"IF(FM3>$DY$3,FL3,FJ3)","v":4},{"$f":"IF(FM3>$DY$3,FK3,FL3)","v":3.99609375},{"$f":"(FN3+FO3)/2","v":3.998046875}]
[null,null,null,null,null,null,null,null,null,{"$f":"IF($AW4=0,\"0\",$AW4)","v":185.35966501167022},"%",null,null,null,null,{"$f":"IF($BW4=0,\"0\",$BW4)","v":141.79240084622893},"%",null,null,null,null,{"$f":"IF($CW4=0,\"0\",$CW4)","v":116.41872459819072},"%",null,null,null,null,{"$f":"IF($DW4=0,\"0\",$DW4)","v":77.158513248060203},"%",null,400,{"$f":"IF(AE3=TRUE,0,AE4)","v":400},null,null,{"$f":"AI2/9.81","v":0.3058103975535168},{"$f":"AF4/100+0.0000000000001","v":4.0000000000001004},{"$f":"Units!$C$20*$BC$2","v":5},{"$f":"0.01*$AG$2/AK4^0.5","v":0.91365737560641413},1,{"$f":"0.01*$AG$2/$AM$2^0.5*AM4","v":1.4446191539641167},{"$f":"$AK$2*(0.4/(4/AJ4-0.6))+10^-10","v":1.1795266000544797},null,null,{"$f":"1/(1/AL4^2+1/AN4^2+1/AO4^2)^0.5","v":0.6460533259888438},{"$f":"IF(AS9-(0.01*AT9/AN4)^2<0.0002,0,AS9-(0.01*AT9/AN4)^2)","v":27.486564328841915},null,{"$f":"100*AR4*AS9^0.5","v":378.68979561884225},{"$f":"(0.01*AU4/AO4)^2","v":10.307461622222551},{"$f":"100*AU4/$AG$2","v":185.35966501167022},null,null,null,null,null,null,null,400,{"$f":"IF(BE3=TRUE,0,BE4)","v":400},null,null,null,{"$f":"BF4/100+0.0000000000001","v":4.0000000000001004},{"$f":"Units!$D$20*BC2","v":9},{"$f":"0.01*$AG$2/BK4^0.5","v":0.68100000000000005},1,{"$f":"0.01*$AG$2/$AM$2^0.5*BM4","v":1.4446191539641167},{"$f":"$AK$2*(0.4/(4/BJ4-0.6))+10^-10","v":1.1795266000544797},null,null,{"$f":"1/(1/BL4^2+1/BN4^2+1/BO4^2)^0.5","v":0.54601471723700989},{"$f":"IF(BS9-(0.01*BT9/BN4)^2<0.0002,0,BS9-(0.01*BT9/BN4)^2)","v":24.126101924261746},null,{"$f":"100*BR4*BS9^0.5","v":289.68187492884573},{"$f":"(0.01*BU4/BO4)^2","v":6.0315254802978364},{"$f":"100*BU4/$AG$2","v":141.79240084622893},null,null,null,null,null,null,null,400,{"$f":"IF(CE3=TRUE,0,CE4)","v":400},null,null,null,{"$f":"CF4/100+0.0000000000001","v":4.0000000000001004},{"$f":"Units!$E$20*BC2","v":7},{"$f":"0.01*$AG$2/CK4^0.5","v":0.77218141835785126},1,{"$f":"0.01*$AG$2/$AM$2^0.5*CM4","v":1.4446191539641167},{"$f":"$AK$2*(0.4/(4/CJ4-0.6))+10^-10","v":1.1795266000544797},null,null,{"$f":"1/(1/CL4^2+1/CN4^2+1/CO4^2)^0.5","v":0.589763299989712},{"$f":"IF(CS9-(0.01*CT9/CN4)^2<0.0002,0,CS9-(0.01*CT9/CN4)^2)","v":13.553319436379432},null,{"$f":"100*CR4*CS9^0.5","v":237.84345435410367},{"$f":"(0.01*CU4/CO4)^2","v":4.0659958304308725},{"$f":"100*CU4/$AG$2","v":116.41872459819072},null,null,null,null,null,null,null,400,{"$f":"IF(DE3=TRUE,0,DE4)","v":400},null,null,null,{"$f":"DF4/100+0.0000000000001","v":4.0000000000001004},{"$f":"Units!$F$20*BC2","v":13},{"$f":"0.01*$AG$2/DK4^0.5","v":0.56662625044407167},1,{"$f":"0.01*$AG$2/$AM$2^0.5*DM4","v":1.4446191539641167},{"$f":"$AK$2*(0.4/(4/DJ4-0.6))+10^-10","v":1.1795266000544797},null,null,{"$f":"1/(1/DL4^2+1/DN4^2+1/DO4^2)^0.5","v":0.48153971799484818},{"$f":"IF(DS9-(0.01*DT9/DN4)^2<0.0002,0,DS9-(0.01*DT9/DN4)^2)","v":9.5254978663386698},null,{"$f":"100*DR4*DS9^0.5","v":157.63484256578701},{"$f":"(0.01*DU4/DO4)^2","v":1.7860308496922612},{"$f":"100*DU4/$AG$2","v":77.158513248060203}]
[null,null,null,null,null,null,{"$f":"IF(H2=0.0000000000001,0,AV6)","v":10.4},null,null,null,null,null,{"$f":"IF(N2=0.0000000000001,0,BV6)","v":6.04},null,null,null,null,null,{"$f":"IF(T2=0.0000000000001,0,CV6)","v":4.07},null,null,null,null,null,{"$f":"IF(Z2=0.0000000000001,0,DV6)","v":1.79},null,null,null,null,null,null,null,null,null,null,null,null,null,null,null,null,null,null,null,null,null,{"$f":"$AU4/$AR$2","v":1.668236985105032},{"$f":"$AV4/$BC$2","v":10.307461622222551},null,null,null,null,"Kvs",null,null,null,null,null,null,null,null,null,null,null,null,null,null,null,null,null,null,null,{"$f":"BU4/$AR$2","v":1.2761316076160605},{"$f":"BV4/$BC$2","v":6.0315254802978364},null,null,null,null,null,null,null,null,null,null,null,null,null,null,null,null,null,null,null,null,null,null,null,null,{"$f":"CU4/$AR$2","v":1.0477685213837167},{"$f":"CV4/$BC$2","v":4.0659958304308725},null,null,null,null,null,null,null,null,null,null,null,null,null,null,null,null,null,null,null,null,null,null,null,null,{"$f":"DU4/$AR$2","v":0.6944266192325419},{"$f":"DV4/$BC$2","v":1.7860308496922612},null,null,"Kvs"]
[null,null,null,null,null,null,null,null,null,null,null,null,null,null,null,null,null,null,null,null,null,null,null,null,null,null,null,null,null,null,null,null,null,null,null,null,null,null,null,null,null,null,null,null,null,null,{"$f":"ROUND(CEILING(AU5,IF(AU5>=100,1,IF(AND(AU5<100,AU5>=10),0.1,IF(AND(AU5<10,AU5>=1),0.01,IF(AND(AU5<1,AU5>=0.1),0.001,0.0001))))),2)","v":1.67},{"$f":"CEILING(AV5,IF(AV5>=100,1,IF(AND(AV5<100,AV5>=10),0.1,IF(AND(AV5<10,AV5>=1),0.01,IF(AND(AV5<1,AV5>=0.1),0.001,0.0001)))))","v":10.4},null,null,null,null,null,null,null,null,null,null,null,null,null,null,null,null,null,null,null,null,null,null,null,null,{"$f":"ROUND(CEILING(BU5,IF(BU5>=100,1,IF(AND(BU5<100,BU5>=10),0.1,IF(AND(BU5<10,BU5>=1),0.01,IF(AND(BU5<1,BU5>=0.1),0.001,0.0001))))),2)","v":1.28},{"$f":"CEILING(BV5,IF(BV5>=100,1,IF(AND(BV5<100,BV5>=10),0.1,IF(AND(BV5<10,BV5>=1),0.01,IF(AND(BV5<1,BV5>=0.1),0.001,0.0001)))))","v":6.04},null,null,null,null,null,null,null,null,null,null,null,null,null,null,null,null,null,null,null,null,null,null,null,null,{"$f":"ROUND(CEILING(CU5,IF(CU5>=100,1,IF(AND(CU5<100,CU5>=10),0.1,IF(AND(CU5<10,CU5>=1),0.01,IF(AND(CU5<1,CU5>=0.1),0.001,0.0001))))),2)","v":1.05},{"$f":"CEILING(CV5,IF(CV5>=100,1,IF(AND(CV5<100,CV5>=10),0.1,IF(AND(CV5<10,CV5>=1),0.01,IF(AND(CV5<1,CV5>=0.1),0.001,0.0001)))))","v":4.07},null,null,null,null,null,null,null,null,null,null,null,null,null,null,null,null,null,null,null,null,null,null,null,null,{"$f":"ROUND(CEILING(DU5,IF(DU5>=100,1,IF(AND(DU5<100,DU5>=10),0.1,IF(AND(DU5<10,DU5>=1),0.01,IF(AND(DU5<1,DU5>=0.1),0.001,0.0001))))),2)","v":0.7},{"$f":"CEILING(DV5,IF(DV5>=100,1,IF(AND(DV5<100,DV5>=10),0.1,IF(AND(DV5<10,DV5>=1),0.01,IF(AND(DV5<1,DV5>=0.1),0.001,0.0001)))))","v":1.79}]
[null,null,null,null,null,null,null,{"$f":"AJ9","v":4.0000000000001004},null,null,null,null,null,{"$f":"$BJ9","v":4.0000000000001004},null,null,null,null,null,{"$f":"CJ9","v":4.0000000000001004},null,null,null,null,null,{"$f":"$DJ9","v":4.0000000000001004},null,null,null,null,null,null,null,null,null,null,null,null,null,null,null,null,null,null,null,null,null,null,null,null,null,null,{"$f":"0.01*BB2*B15/(BI2)^0.5","v":1.1795265999544056},null,null,null,null,null,null,null,null,null,null,null,null,null,null,null,null,null,null,null,null,null,null,null,null,null,null,null,null,null,null,null,null,null,null,null,null,null,null,null,null,null,null,null,null,null,null,null,null,null,null,null,null,null,null,null,null,null,null,null,null,null,null,null,null,null,null,null,null,null,null,null,null,null,null,null,{"$f":"BA7","v":1.1795265999544056}]
[null,null,null,null,null,null,null,null,null,{"$f":"IF(AU11&\" \"&$AZ$2=\"0.0001 GPM\",\"0 GPM\",AU11&\" \"&$AZ$2)","v":"1.87 GPM"},null,null,null,null,null,{"$f":"IF(BU11&\" \"&$AZ$2=\"0.0001 GPM\",\"0 GPM\",BU11&\" \"&$AZ$2)","v":"1.24 GPM"},null,null,null,null,null,{"$f":"IF(CU11&\" \"&$AZ$2=\"0.0001 GPM\",\"0 GPM\",CU11&\" \"&$AZ$2)","v":"1.29 GPM"},null,null,null,null,null,{"$f":"IF(DU11&\" \"&$AZ$2=\"0.0001 GPM\",\"0 GPM\",DU11&\" \"&$AZ$2)","v":"0.98 GPM"},null,null,false,"Pos4",null,null,null,"Pos",{"$f":"\"C\"&(6-AM9)","v":"C4"},{"$f":"\"KvC\"&(6-AM9)","v":"KvC4"},"Nb",{"$f":"\"KvL\"&(6-AM9)","v":"KvL4"},{"$f":"\"Kvs\"&(6-AM9)","v":"Kvs4"},{"$f":"\"D1\"","v":"D1"},{"$f":"\"D2\"","v":"D2"},"KvD","PD",{"$f":"\"q45\"","v":"q45"},{"$f":"\"q4\"","v":"q4"},null,null,null,null,null,null,null,null,null,false,"Pos4",null,null,null,"Pos",{"$f":"\"C\"&(6-BM9)","v":"C4"},{"$f":"\"KvC\"&(6-BM9)","v":"KvC4"},"Nb",{"$f":"\"KvL\"&(6-BM9)","v":"KvL4"},{"$f":"\"Kvs\"&(6-BM9)","v":"Kvs4"},{"$f":"\"D1\"","v":"D1"},{"$f":"\"D2\"","v":"D2"},"KvD","PD",{"$f":"\"q45\"","v":"q45"},{"$f":"\"q4\"","v":"q4"},null,null,null,null,null,null,null,null,null,false,"Pos4",null,null,null,"Pos",{"$f":"\"C\"&(6-CM9)","v":"C4"},{"$f":"\"KvC\"&(6-CM9)","v":"KvC4"},"Nb",{"$f":"\"KvL\"&(6-CM9)","v":"KvL4"},{"$f":"\"Kvs\"&(6-CM9)","v":"Kvs4"},{"$f":"\"D1\"","v":"D1"},{"$f":"\"D2\"","v":"D2"},"KvD","PD",{"$f":"\"q45\"","v":"q45"},{"$f":"\"q4\"","v":"q4"},null,null,null,null,null,null,null,null,null,false,"Pos4",null,null,null,"Pos",{"$f":"\"C\"&(6-DM9)","v":"C4"},{"$f":"\"KvC\"&(6-DM9)","v":"KvC4"},"Nb",{"$f":"\"KvL\"&(6-DM9)","v":"KvL4"},{"$f":"\"Kvs\"&(6-DM9)","v":"Kvs4"},{"$f":"\"D1\"","v":"D1"},{"$f":"\"D2\"","v":"D2"},"KvD","PD",{"$f":"\"q45\"","v":"q45"},{"$f":"\"q4\"","v":"q4"}]
{"$rows_left_out":41}